BDBM50403631 CHEMBL557206
SMILES CC(C)(N)C(=O)N[C@H](COCc1ccccc1)C(=O)N1CCC2(CCc3ccccc23)CC1
InChI Key InChIKey=WEJSODMUGFBSEP-HSZRJFAPSA-N
Data  1 EC50
  Tab Delimited (TSV)   2D SDfile   Computed 3D by Vconf -m prep SDfile
Find this compound or compounds like it in BindingDB:
Activity Spreadsheet -- Enzyme Inhibition Constant Data from BindingDB
Found 1 hit for monomerid = 50403631
TargetGrowth hormone-releasing hormone receptor(Rattus norvegicus)
TBA
Curated by ChEMBL
LigandPNGBDBM50403631(CHEMBL557206)
Affinity DataEC50:  17nM. Assay description: Ability to release growth hormone in a rat pituitary cell assay
In DepthDetails Article