BDBM50403634 CHEMBL552657
SMILES CCOC(=O)C[C@@H]1CC2(CCN(CC2)C(=O)[C@@H](Cc2c[nH]c3ccccc23)NC(=O)C(C)(C)N)c2ccccc12
InChI Key InChIKey=MYQAPLQODBOKJG-JIPXPUAJSA-N
Data  1 EC50
  Tab Delimited (TSV)   2D SDfile   Computed 3D by Vconf -m prep SDfile
Find this compound or compounds like it in BindingDB:
Activity Spreadsheet -- Enzyme Inhibition Constant Data from BindingDB
Found 1 hit for monomerid = 50403634
TargetGrowth hormone-releasing hormone receptor(Rattus norvegicus)
TBA
Curated by ChEMBL
LigandPNGBDBM50403634(CHEMBL552657)
Affinity DataEC50:  7nM. Assay description: Ability to release growth hormone in a rat pituitary cell assay
In DepthDetails Article