BDBM50405132 CHEMBL610425
SMILES CS(=O)(=O)OC[C@H]1OC(=O)[C@H](O)[C@@H]1O
InChI Key InChIKey=XCIKTKDEVZFVIM-UOWFLXDJSA-N
Data  1 IC50
  Tab Delimited (TSV)   2D SDfile   Computed 3D by Vconf -m prep SDfile
Find this compound or compounds like it in BindingDB:
Activity Spreadsheet -- Enzyme Inhibition Constant Data from BindingDB
Found 1 hit for monomerid = 50405132
TargetArabinose 5-phosphate isomerase KdsD(Salmonella typhimurium)
TBA
Curated by ChEMBL
LigandPNGBDBM50405132(CHEMBL610425)
Affinity DataIC50:  8.40E+6nM. Assay description: Inhibitory activity against Arabinose-5-phosphate isomerase
In DepthDetails ArticlePubMed