BDBM50405303 CHEMBL2021336
SMILES CC(C)N(C(C)C)C(=O)[C@H]1CC[C@H]2[C@@H]3CC[C@H]4N(C)C(=O)CC[C@]4(C)[C@H]3CC[C@]12C
InChI Key InChIKey=NGCDFLLKUVHKMH-BJWOPKJYSA-N
Data  2 IC50
  Tab Delimited (TSV)   2D SDfile   Computed 3D by Vconf -m prep SDfile
Find this compound or compounds like it in BindingDB:
Activity Spreadsheet -- Enzyme Inhibition Constant Data from BindingDB
Found 2 hits for monomerid = 50405303
Target3-oxo-5-alpha-steroid 4-dehydrogenase 1/2(Rattus norvegicus)
TBA
Curated by ChEMBL
LigandPNGBDBM50405303(CHEMBL2021336)
Affinity DataIC50:  3.5nM. Assay description: In vitro inhibitory activity against rat prostatic steroid 5-alpha-reductase
In DepthDetails ArticlePubMed
TargetAndrogen receptor(Rattus norvegicus (Rat))
TBA
Curated by ChEMBL
LigandPNGBDBM50405303(CHEMBL2021336)
Affinity DataIC50:  1.40E+4nM. Assay description: In vitro antagonist activity against rat prostatic androgen receptor (AR)
In DepthDetails ArticlePubMed