BDBM50405396 CHEMBL2051762
SMILES C[C@H]1C[C@H](O)[C@H](O)[C@@H](O)[C@H]1N[C@H]1C[C@](O)(CO)[C@@H](O)[C@H](O)[C@H]1O
InChI Key InChIKey=WJJVGBUUWKHCQX-GWKHEUGJSA-N
Data  2 IC50
  Tab Delimited (TSV)   2D SDfile   Computed 3D by Vconf -m prep SDfile
Find this compound or compounds like it in BindingDB:
Activity Spreadsheet -- Enzyme Inhibition Constant Data from BindingDB
Found 2 hits for monomerid = 50405396
TargetSucrase-isomaltase, intestinal(Homo sapiens (Human))
TBA
Curated by ChEMBL
LigandPNGBDBM50405396(CHEMBL2051762)
Affinity DataIC50:  36nM. Assay description: Alpha-D-glucosidase inhibitory activity and enzyme inhibition in vitro against porcine sucrase
In DepthDetails ArticlePubMed
TargetMaltase-glucoamylase(Homo sapiens (Human))
TBA
Curated by ChEMBL
LigandPNGBDBM50405396(CHEMBL2051762)
Affinity DataIC50:  68nM. Assay description: Inhibitory activity against porcine maltase
In DepthDetails ArticlePubMed