BDBM50406500 CHEMBL4166573
SMILES Fc1ccc(Nc2cncc(c2)N2CC3CC(C2)N3)cc1
InChI Key InChIKey=PHXYNFXNEHTNMS-UHFFFAOYSA-N
Data  3 KI
  Tab Delimited (TSV)   2D SDfile   Computed 3D by Vconf -m prep SDfile
Find this compound or compounds like it in BindingDB:
Activity Spreadsheet -- Enzyme Inhibition Constant Data from BindingDB
Found 3 hits for monomerid = 50406500
TargetNeuronal acetylcholine receptor subunit alpha-4/beta-2(Rattus norvegicus (Rat))
Istituto Di Chimica Biomolecolare
Curated by ChEMBL
LigandPNGBDBM50406500(CHEMBL4166573)
Affinity DataKi:  0.0910nM. Assay description: Displacement of [3H]epibatidine from alpha4beta2 nAChR in rat cortex membranes
In DepthDetails ArticlePubMed
TargetNeuronal acetylcholine receptor subunit alpha-3/beta-4(Homo sapiens (Human))
Istituto Di Chimica Biomolecolare
Curated by ChEMBL
LigandPNGBDBM50406500(CHEMBL4166573)
Affinity DataKi:  1.30nM. Assay description: Displacement of [3H]epibatidine from human alpha3beta4 nAChR expressed in HEK293 cell membranes
In DepthDetails ArticlePubMed
TargetNeuronal acetylcholine receptor subunit alpha-7(Rattus norvegicus (Rat))
Istituto Di Chimica Biomolecolare
Curated by ChEMBL
LigandPNGBDBM50406500(CHEMBL4166573)
Affinity DataKi:  441nM. Assay description: Displacement of [125I]alpha-bungarotoxin from alpha7 nAChR in rat hippocampal membranes
In DepthDetails ArticlePubMed