BDBM50407527 CHEMBL2113521
SMILES OC[C@H]1O[C@H]([C@H](O)[C@@H]1O)n1cnc2c(NC3CC3)cc(Cl)nc12
InChI Key InChIKey=NPHATOGXVQXFFX-LHNIVKCTSA-N
Data  1 KI
  Tab Delimited (TSV)   2D SDfile   Computed 3D by Vconf -m prep SDfile
Find this compound or compounds like it in BindingDB:
Activity Spreadsheet -- Enzyme Inhibition Constant Data from BindingDB
Found 1 hit for monomerid = 50407527
TargetAdenosine deaminase(Bos taurus (bovine))
Universit£
Curated by ChEMBL
LigandPNGBDBM50407527(CHEMBL2113521)
Affinity DataKi: >1.00E+5nM. Assay description: Inhibition calf intestine adenosine deaminase
In DepthDetails ArticlePubMed