BDBM50407531 CHEMBL2113477
SMILES OC[C@H]1O[C@H]([C@H](O)[C@@H]1O)n1cnc2c(NC3CCC3)cc(Cl)nc12
InChI Key InChIKey=BYUOLLLTVKGIIB-QGMIFYJMSA-N
Data  1 KI
  Tab Delimited (TSV)   2D SDfile   Computed 3D by Vconf -m prep SDfile
Find this compound or compounds like it in BindingDB:
Activity Spreadsheet -- Enzyme Inhibition Constant Data from BindingDB
Found 1 hit for monomerid = 50407531
TargetAdenosine deaminase(Bos taurus (bovine))
Universit£
Curated by ChEMBL
LigandPNGBDBM50407531(CHEMBL2113477)
Affinity DataKi:  9.70E+4nM. Assay description: Inhibition calf intestine adenosine deaminase
In DepthDetails ArticlePubMed