BDBM50408107 CHEMBL56789
SMILES O=C(NCc1ccccc1)N1CCCC[C@H]1C(=O)OCc1ccccc1
InChI Key InChIKey=KKBWGPBSBAQQGD-IBGZPJMESA-N
Data  1 KI
  Tab Delimited (TSV)   2D SDfile   Computed 3D by Vconf -m prep SDfile
Find this compound or compounds like it in BindingDB:
Activity Spreadsheet -- Enzyme Inhibition Constant Data from BindingDB
Found 1 hit for monomerid = 50408107
TargetPeptidyl-prolyl cis-trans isomerase FKBP1A(Homo sapiens (Human))
Agouron Pharmaceuticals
Curated by ChEMBL
LigandPNGBDBM50408107(CHEMBL56789)
Affinity DataKi:  6.50E+3nM. Assay description: Apparent inhibition constant of Wild-type human recombinant FK506 binding protein 12
In DepthDetails ArticlePubMed