BDBM50408414 CHEMBL2113720
SMILES COc1cc(cc(CNC(=O)N(C)O)c1OCCSc1ccc(Cl)cc1)[C@@H]1CC[C@H](O1)c1cc(OC)c(OC)c(OC)c1
InChI Key InChIKey=LZVBMKDVEPGGFK-DQEYMECFSA-N
Data  2 IC50
  Tab Delimited (TSV)   2D SDfile   Computed 3D by Vconf -m prep SDfile
Find this compound or compounds like it in BindingDB:
Activity Spreadsheet -- Enzyme Inhibition Constant Data from BindingDB
Found 2 hits for monomerid = 50408414
TargetPolyunsaturated fatty acid 5-lipoxygenase(Rattus norvegicus)
University Of Virginia
Curated by ChEMBL
LigandPNGBDBM50408414(CHEMBL2113720)
Affinity DataIC50:  100nM. Assay description: Inhibition of 5-lipoxygenase mediated conversion of [14C]-arachidonic acid to leukotrienes in RBL-2H3 cells
In DepthDetails ArticlePubMed
TargetPlatelet-activating factor receptor(Homo sapiens (Human))
University Of Virginia
Curated by ChEMBL
LigandPNGBDBM50408414(CHEMBL2113720)
Affinity DataIC50:  10nM. Assay description: Displacement of [3H]-PAF from PAF receptor of human platelet membranes
In DepthDetails ArticlePubMed