BDBM50409349 CHEMBL385441
SMILES CC(C)[C@H](NC(=O)[C@H](CCC(N)=O)NC(=O)[C@H](Cc1c[nH]c2ccccc12)NC(=O)[C@H](Cc1ccc(O)cc1)NC(=O)[C@H](CCC(N)=O)NC(=O)CNC(=O)[C@H](Cc1c[nH]c2ccccc12)NC(=O)[C@@H](NC(=O)[C@@H](N)CCCCN)[C@@H](C)O)C(O)=O
InChI Key InChIKey=AYARWZFGXHSQNT-IZVYDTQKSA-N
Data  1 IC50
  Tab Delimited (TSV)   2D SDfile   Computed 3D by Vconf -m prep SDfile
Find this compound or compounds like it in BindingDB:
Activity Spreadsheet -- Enzyme Inhibition Constant Data from BindingDB
Found 1 hit for monomerid = 50409349
TargetHLA class I histocompatibility antigen, A alpha chain(Homo sapiens (Human))
Edward Jenner Institute For Vaccine Research
Curated by ChEMBL
LigandPNGBDBM50409349(CHEMBL385441)
Affinity DataIC50:  11.1nM. Assay description: MHC class I HLA-A*0201 binding affinity assayed by based inhibition of binding of a radiolabeled standard peptide (FLPSDYFPSV)
In DepthDetails ArticlePubMed