BDBM50409761 CHEMBL2112863
SMILES CNc1ncnc2n(cnc12)[C@H]1C[C@H](OP(O)(O)=O)[C@]2(COP(O)(O)=O)C[C@H]12
InChI Key InChIKey=FQABQZAJQNHBSV-LWIGBJQBSA-N
Data  1 KI  1 IC50
  Tab Delimited (TSV)   2D SDfile   Computed 3D by Vconf -m prep SDfile
Find this compound or compounds like it in BindingDB:
Activity Spreadsheet -- Enzyme Inhibition Constant Data from BindingDB
Found 2 hits for monomerid = 50409761
TargetP2Y purinoceptor 1(Homo sapiens (Human))
Niddk
Curated by ChEMBL
LigandPNGBDBM50409761(CHEMBL2112863)
Affinity DataKi:  17.6nM. Assay description: Inhibition of [3H]-5 binding to P2Y purinoceptor 1 expressed in Sf9 cells
In DepthDetails ArticlePubMed
TargetP2Y purinoceptor 1(Homo sapiens (Human))
Niddk
Curated by ChEMBL
LigandPNGBDBM50409761(CHEMBL2112863)
Affinity DataIC50:  157nM. Assay description: Antagonistic activity against P2Y purinoceptor 1
In DepthDetails ArticlePubMed