BDBM50410312 CHEMBL2112048
SMILES C[C@H]1CC[C@H](CC1)C(=O)c1ccc2nc3CCCCCc3cc2c1
InChI Key InChIKey=JPBVNSVFRMNFNJ-IYBDPMFKSA-N
Data  1 IC50
  Tab Delimited (TSV)   2D SDfile   Computed 3D by Vconf -m prep SDfile
Find this compound or compounds like it in BindingDB:
Activity Spreadsheet -- Enzyme Inhibition Constant Data from BindingDB
Found 1 hit for monomerid = 50410312
TargetMetabotropic glutamate receptor 1(Homo sapiens (Human))
Janssen-Cilag
Curated by ChEMBL
LigandPNGBDBM50410312(CHEMBL2112048)
Affinity DataIC50:  16nM. Assay description: Inhibitory concentration against human metabotropic glutamate receptor
In DepthDetails ArticlePubMed