BDBM50411097 CHEMBL379557
SMILES Oc1c(ccc2nn[nH]c12)C(=O)Nc1ccc(Oc2ccccc2)cc1
InChI Key InChIKey=LUTKBALCXDXCTB-UHFFFAOYSA-N
Data  2 IC50
  Tab Delimited (TSV)   2D SDfile   Computed 3D by Vconf -m prep SDfile
Find this compound or compounds like it in BindingDB:
Activity Spreadsheet -- Enzyme Inhibition Constant Data from BindingDB
Found 2 hits for monomerid = 50411097
TargetSuccinate dehydrogenase [ubiquinone] iron-sulfur subunit, mitochondrial(Septoria tritici)
Fmc Stine Research Center
Curated by ChEMBL
LigandPNGBDBM50411097(CHEMBL379557)
Affinity DataIC50:  32nM. Assay description: Inhibition of Septoria nodorum succinate dehydrogenase and Qi site of mitochondrial respiratory chain complex 3 by FMET2-3 assay
In DepthDetails ArticlePubMed
TargetSuccinate dehydrogenase [ubiquinone] iron-sulfur subunit, mitochondrial(Septoria tritici)
Fmc Stine Research Center
Curated by ChEMBL
LigandPNGBDBM50411097(CHEMBL379557)
Affinity DataIC50: >3.00E+4nM. Assay description: Inhibition of Septoria nodorum succinate dehydrogenase by FMET2 assay
In DepthDetails ArticlePubMed