BDBM50412254 CHEMBL492445
SMILES C1CN=C(N1)C1COc2ccc(cc2O1)-c1ccccc1
InChI Key InChIKey=CENDKGWAICPCEX-UHFFFAOYSA-N
Data  3 KI
  Tab Delimited (TSV)   2D SDfile   Computed 3D by Vconf -m prep SDfile
Find this compound or compounds like it in BindingDB:
Activity Spreadsheet -- Enzyme Inhibition Constant Data from BindingDB
Found 3 hits for monomerid = 50412254
TargetAlpha-2A adrenergic receptor(Homo sapiens (Human))
Universit£
Curated by ChEMBL
LigandPNGBDBM50412254(CHEMBL492445)
Affinity DataKi:  398nM. Assay description: Displacement of [3H]RS79948-197 from human recombinant adrenergic alpha2A receptor expressed in CHO cells
In DepthDetails ArticlePubMed
TargetAlpha-2B adrenergic receptor(Homo sapiens (Human))
Universit£
Curated by ChEMBL
LigandPNGBDBM50412254(CHEMBL492445)
Affinity DataKi:  1.00E+3nM. Assay description: Displacement of [3H]RS79948-197 from human recombinant adrenergic alpha2B receptor expressed in CHO cells
In DepthDetails ArticlePubMed
TargetAlpha-2C adrenergic receptor(Homo sapiens (Human))
Universit£
Curated by ChEMBL
LigandPNGBDBM50412254(CHEMBL492445)
Affinity DataKi:  1.26E+3nM. Assay description: Displacement of [3H]RS79948-197 from human recombinant adrenergic Alpha-2C receptor expressed in CHO cells
In DepthDetails ArticlePubMed