BDBM50414607 CHEMBL563812
SMILES CCN(CC(O)(CNc1cccc2n(ncc12)-c1ccc(F)cc1)C(F)(F)F)C(=O)c1ccccc1Cl
InChI Key InChIKey=HRFKPFGACADFTC-UHFFFAOYSA-N
Data  1 IC50
  Tab Delimited (TSV)   2D SDfile   Computed 3D by Vconf -m prep SDfile
Find this compound or compounds like it in BindingDB:
Activity Spreadsheet -- Enzyme Inhibition Constant Data from BindingDB
Found 1 hit for monomerid = 50414607
TargetGlucocorticoid receptor(Homo sapiens (Human))
Glaxosmithkline
Curated by ChEMBL
LigandPNGBDBM50414607(CHEMBL563812)
Affinity DataIC50:  0.251nM. Assay description: Agonist activity at GR in human A549 cells by NF-kappaB transrepression assay
In DepthDetails ArticlePubMed