BDBM50415080 CHEMBL585157
SMILES OC(=O)[C@H](Cc1ccc(F)c(Br)c1)NC(=O)c1ccc(Br)cc1NS(=O)(=O)c1cccc2nsnc12
InChI Key InChIKey=ORNPSHYZIGSMSG-SFHVURJKSA-N
Data  2 KI
  Tab Delimited (TSV)   2D SDfile   Computed 3D by Vconf -m prep SDfile
Find this compound or compounds like it in BindingDB:
Activity Spreadsheet -- Enzyme Inhibition Constant Data from BindingDB
Found 2 hits for monomerid = 50415080
TargetGastrin/cholecystokinin type B receptor(Homo sapiens (Human))
Johnson & Johnson Pharmaceutical Research And Development
Curated by ChEMBL
LigandPNGBDBM50415080(CHEMBL585157)
Affinity DataKi:  6.31nM. Assay description: Displacement of [125I]-CCK-8S from human CCK-2R after 100 mins by liquid scintillation counting
In DepthDetails ArticlePubMed
TargetCholecystokinin receptor type A(Homo sapiens (Human))
Johnson & Johnson Pharmaceutical Research And Development
Curated by ChEMBL
LigandPNGBDBM50415080(CHEMBL585157)
Affinity DataKi:  251nM. Assay description: Displacement of [125I]-CCK-8S from human CCK-1R after 100 mins by liquid scintillation counting
In DepthDetails ArticlePubMed