BDBM50415495 CHEMBL591013
SMILES CN1CCN(CC1)c1nc(NCCS(=O)(=O)Nc2ccccc2)c2c(Cl)cc(Cl)cc2n1
InChI Key InChIKey=DFDYNDWPTRICOV-UHFFFAOYSA-N
Data  1 KI
  Tab Delimited (TSV)   2D SDfile   Computed 3D by Vconf -m prep SDfile
Find this compound or compounds like it in BindingDB:
Activity Spreadsheet -- Enzyme Inhibition Constant Data from BindingDB
Found 1 hit for monomerid = 50415495
TargetHistamine H4 receptor(Homo sapiens (Human))
Griffin Discoveries
Curated by ChEMBL
LigandPNGBDBM50415495(CHEMBL591013)
Affinity DataKi:  151nM. Assay description: Displacement of [3H]histamine from human histamine H4 receptor expressed in HEK293T cells
In DepthDetails ArticlePubMed