BDBM50417400 CHEMBL1289937
SMILES Fc1cccc(n1)N1C[C@@]2(CC[C@@H](CC2)c2nc3ccc(cc3[nH]2)C(F)(F)F)OC1=O
InChI Key InChIKey=CZTLAQBTSSYVJP-NJDVURJYSA-N
Data  1 KI
  Tab Delimited (TSV)   2D SDfile   Computed 3D by Vconf -m prep SDfile
Find this compound or compounds like it in BindingDB:
Activity Spreadsheet -- Enzyme Inhibition Constant Data from BindingDB
Found 1 hit for monomerid = 50417400
TargetNeuropeptide Y receptor type 5(Homo sapiens (Human))
Glaxosmithkline
Curated by ChEMBL
LigandPNGBDBM50417400(CHEMBL1289937)
Affinity DataKi:  3.98nM. Assay description: Antagonistic activity at human NPY Y5 receptor expressed in HEK293 cells assessed as inhibition of calcium level by FLIPR assay
In DepthDetails ArticlePubMed