BDBM50417562 CHEMBL1642166
SMILES CCS(=O)(=O)N[C@H]1Cc2ccc(Cn3cc(CO)c(n3)C(F)(F)F)cc2C1
InChI Key InChIKey=RRWIGUFXQVAWHG-HNNXBMFYSA-N
Data  1 EC50
  Tab Delimited (TSV)   2D SDfile   Computed 3D by Vconf -m prep SDfile
Find this compound or compounds like it in BindingDB:
Activity Spreadsheet -- Enzyme Inhibition Constant Data from BindingDB
Found 1 hit for monomerid = 50417562
TargetGlutamate receptor 2(Homo sapiens (Human))
Merck Research Laboratories
Curated by ChEMBL
LigandPNGBDBM50417562(CHEMBL1642166)
Affinity DataEC50:  398nM. Assay description: Modulatory activity at GluA2 receptor LBD
In DepthDetails ArticlePubMed