BDBM50417674 CHEMBL1643361
SMILES Nc1nccc2cc(CNCCc3ccccc3)ccc12
InChI Key InChIKey=ACQAMOITEMIUTC-UHFFFAOYSA-N
Data  2 KI  3 IC50
  Tab Delimited (TSV)   2D SDfile   Computed 3D by Vconf -m prep SDfile
Find this compound or compounds like it in BindingDB:
Activity Spreadsheet -- Enzyme Inhibition Constant Data from BindingDB
Found 5 hits for monomerid = 50417674
TargetRho-associated protein kinase 1(Homo sapiens (Human))
Msd
Curated by ChEMBL
LigandPNGBDBM50417674(CHEMBL1643361)
Affinity DataKi:  63.1nM. Assay description: Inhibition of ROCK-1
In DepthDetails ArticlePubMed
TargetPotassium voltage-gated channel subfamily H member 2(Homo sapiens (Human))
Msd
Curated by ChEMBL
LigandPNGBDBM50417674(CHEMBL1643361)
Affinity DataKi:  3.16E+3nM. Assay description: Displacement of [3H]dofetilide from human ERG
In DepthDetails ArticlePubMed
TargetC-C motif chemokine 2(Homo sapiens (Human))
Msd
Curated by ChEMBL
LigandPNGBDBM50417674(CHEMBL1643361)
Affinity DataIC50: >3.16E+4nM. Assay description: Inhibition of MCP1-mediated human THP cell migration
In DepthDetails ArticlePubMed
TargetRho-associated protein kinase 1(Homo sapiens (Human))
Msd
Curated by ChEMBL
LigandPNGBDBM50417674(CHEMBL1643361)
Affinity DataIC50:  1.29E+3nM. Assay description: Inhibition of ROCK-1 by Immobilized metal ion affinity-based fluorescence polarization assay
In DepthDetails ArticlePubMed
TargetRho-associated protein kinase 2(Homo sapiens (Human))
Msd
Curated by ChEMBL
LigandPNGBDBM50417674(CHEMBL1643361)
Affinity DataIC50:  1.29E+3nM. Assay description: Inhibition of ROCK-2 by Immobilized metal ion affinity-based fluorescence polarization assay
In DepthDetails ArticlePubMed