BDBM50418015 CHEMBL1682269
SMILES CS(=O)(=O)N(CCO)Cc1nc(ns1)-c1cn(CC2CCOCC2)c2c(Cl)cccc12
InChI Key InChIKey=BGLWQDIXRWKLSN-UHFFFAOYSA-N
Data  1 EC50
  Tab Delimited (TSV)   2D SDfile   Computed 3D by Vconf -m prep SDfile
Find this compound or compounds like it in BindingDB:
Activity Spreadsheet -- Enzyme Inhibition Constant Data from BindingDB
Found 1 hit for monomerid = 50418015
TargetCannabinoid receptor 1(Homo sapiens (Human))
Merck Research Laboratories
Curated by ChEMBL
LigandPNGBDBM50418015(CHEMBL1682269)
Affinity DataEC50:  19.9nM. Assay description: Agonist activity at human cannabinoid CB1 receptor expressed in CHO cells by luciferase reporter gene assay
In DepthDetails ArticlePubMed