BDBM50418751 CHEMBL1796032
SMILES COc1ccc(Cl)cc1N1CCN(CCCN2C(=O)CC(CC2=O)c2ccccc2)CC1
InChI Key InChIKey=YDXRRAQRFWEWFK-UHFFFAOYSA-N
Data  3 KI
  Tab Delimited (TSV)   2D SDfile   Computed 3D by Vconf -m prep SDfile
Find this compound or compounds like it in BindingDB:
Activity Spreadsheet -- Enzyme Inhibition Constant Data from BindingDB
Found 3 hits for monomerid = 50418751
TargetAlpha-1A adrenergic receptor(Homo sapiens (Human))
Universit£
Curated by ChEMBL
LigandPNGBDBM50418751(CHEMBL1796032)
Affinity DataKi:  191nM. Assay description: Displacement of [125I]BE-2254 from human adrenergic alpha1A receptor expressed in HEK293 cells
In DepthDetails ArticlePubMed
TargetAlpha-1B adrenergic receptor(Homo sapiens (Human))
Universit£
Curated by ChEMBL
LigandPNGBDBM50418751(CHEMBL1796032)
Affinity DataKi:  331nM. Assay description: Displacement of [125I]BE-2254 from human adrenergic Alpha-1B receptor expressed in HEK293 cells
In DepthDetails ArticlePubMed
TargetAlpha-1D adrenergic receptor(Homo sapiens (Human))
Universit£
Curated by ChEMBL
LigandPNGBDBM50418751(CHEMBL1796032)
Affinity DataKi:  389nM. Assay description: Displacement of [125I]BE-2254 from human adrenergic Alpha-1D receptor expressed in HEK293 cells
In DepthDetails ArticlePubMed