BDBM50420706 CHEMBL2087466
SMILES CS(=O)(=O)N1CCN(Cc2cn3cc(nc(N4CCOCC4)c3n2)-c2cnc3[nH]ccc3c2)CC1
InChI Key InChIKey=RHHVXWQSGJNNDR-UHFFFAOYSA-N
Data  1 IC50
  Tab Delimited (TSV)   2D SDfile   Computed 3D by Vconf -m prep SDfile
Find this compound or compounds like it in BindingDB:
Activity Spreadsheet -- Enzyme Inhibition Constant Data from BindingDB
Found 1 hit for monomerid = 50420706
TargetPhosphatidylinositol 3-kinase regulatory subunit alpha/4,5-bisphosphate 3-kinase catalytic subunit alpha isoform(Homo sapiens (Human))
Spanish National Cancer Research Centre (Cnio)
Curated by ChEMBL
LigandPNGBDBM50420706(CHEMBL2087466)
Affinity DataIC50:  113nM. Assay description: Inhibition of human PI3Kalpha (p110alpha/p85alpha) by ADP accumulation based HTRF assay
In DepthDetails ArticlePubMed