BDBM50421234 CHEMBL1289049
SMILES Cn1c2c([nH+]c3ccccc23)c(NC2CCNCC2)c2ccc(Cl)cc12
InChI Key InChIKey=CFUWLMSJPFIWNX-UHFFFAOYSA-O
Data  1 IC50
  Tab Delimited (TSV)   2D SDfile   Computed 3D by Vconf -m prep SDfile
Find this compound or compounds like it in BindingDB:
Activity Spreadsheet -- Enzyme Inhibition Constant Data from BindingDB
Found 1 hit for monomerid = 50421234
TargetCathepsin B-like cysteine protease(Trypanosoma brucei)
University Of Lisbon
Curated by ChEMBL
LigandPNGBDBM50421234(CHEMBL1289049)
Affinity DataIC50:  5.90E+4nM. Assay description: Inhibition of Trypanosoma brucei CatB
In DepthDetails ArticlePubMed