BDBM50421283 CHEMBL2087659
SMILES O=C1CCCN1CCOc1ccc(cc1)-c1oc2ncnc(NC[C@@H]3CCCO3)c2c1-c1ccccc1
InChI Key InChIKey=XBDUCNRQAWTJSA-QHCPKHFHSA-N
Data  1 KI  1 IC50
  Tab Delimited (TSV)   2D SDfile   Computed 3D by Vconf -m prep SDfile
Find this compound or compounds like it in BindingDB:
Activity Spreadsheet -- Enzyme Inhibition Constant Data from BindingDB
Found 2 hits for monomerid = 50421283
TargetActivated CDC42 kinase 1(Homo sapiens (Human))
Amgen
Curated by ChEMBL
LigandPNGBDBM50421283(CHEMBL2087659)
Affinity DataKi:  4nM. Assay description: Inhibition of N-terminal His6-tagged ACK1 expressed in baculovirus infected Hi5 cells assessed as inhibition of autophosphorylation after 2 hrs by EL...
In DepthDetails ArticlePubMed
TargetActivated CDC42 kinase 1(Mus musculus)
Amgen
Curated by ChEMBL
LigandPNGBDBM50421283(CHEMBL2087659)
Affinity DataIC50:  230nM. Assay description: Inhibition of ACK1 in mouse C8 cells assessed as decrease in cell viability after 20 to 24 hrs
In DepthDetails ArticlePubMed