BDBM50421411 CHEMBL2304168
SMILES C[C@@H]1C(=O)O[C@H]2[C@H](OCc3ccc(Cl)cc3)C34[C@H]5C[C@@H](C(C)(C)C)[C@@]33[C@@H](O)C(=O)O[C@H]3O[C@@]4(C(=O)O5)[C@@]12O
InChI Key InChIKey=JFGFWEQZGPVYIM-ZCSDDIRMSA-N
Data  1 IC50
  Tab Delimited (TSV)   2D SDfile   Computed 3D by Vconf -m prep SDfile
Find this compound or compounds like it in BindingDB:
Activity Spreadsheet -- Enzyme Inhibition Constant Data from BindingDB
Found 1 hit for monomerid = 50421411
TargetPlatelet-activating factor receptor(Homo sapiens (Human))
Chinese Academy Of Sciences
Curated by ChEMBL
LigandPNGBDBM50421411(CHEMBL2304168)
Affinity DataIC50:  29nM. Assay description: Compound was evaluated for anti-platelet activating factor potency
In DepthDetails ArticlePubMed