BDBM50421732 CHEMBL1159711::VUF8303
SMILES CC(C)(C)NCC(O)c1cc(Cl)c(O)c(Cl)c1
InChI Key InChIKey=YCDVEEJCUBEZMD-UHFFFAOYSA-N
Data  3 Kd
  Tab Delimited (TSV)   2D SDfile   Computed 3D by Vconf -m prep SDfile
Find this compound or compounds like it in BindingDB:
Activity Spreadsheet -- Enzyme Inhibition Constant Data from BindingDB
Found 3 hits for monomerid = 50421732
TargetBeta-2 adrenergic receptor(BOVINE)
TBA
Curated by ChEMBL
LigandPNGBDBM50421732(CHEMBL1159711 | VUF8303)
Affinity DataKd:  6.47E+3nM. Assay description: Apparent binding affinity constant to beta-2 adrenergic receptor determined using [3H]DHA
In DepthDetails ArticlePubMed
TargetBeta-2 adrenergic receptor(BOVINE)
TBA
Curated by ChEMBL
LigandPNGBDBM50421732(CHEMBL1159711 | VUF8303)
Affinity DataKd:  39nM. Assay description: Affinity for cow beta-2 adrenergic receptor by measuring displacement (-)-[3H]dihydroalprenolol (DHA)
In DepthDetails ArticlePubMed
TargetBeta-2 adrenergic receptor(BOVINE)
TBA
Curated by ChEMBL
LigandPNGBDBM50421732(CHEMBL1159711 | VUF8303)
Affinity DataKd:  1.95E+3nM. Assay description: Affinity for cow beta-2 adrenergic receptor by measuring displacement (-)-[3H]dihydroalprenolol (DHA)
In DepthDetails ArticlePubMed