BDBM50422420 CHEMBL4164576
SMILES Nc1ccc2ccc(nc2c1)C(=O)c1ccc(F)c(O)c1
InChI Key InChIKey=RAJZMFGCSIPKIZ-UHFFFAOYSA-N
Data  1 KI
  Tab Delimited (TSV)   2D SDfile   Computed 3D by Vconf -m prep SDfile
Find this compound or compounds like it in BindingDB:
Activity Spreadsheet -- Enzyme Inhibition Constant Data from BindingDB
Found 1 hit for monomerid = 50422420
Target17-beta-hydroxysteroid dehydrogenase 14(Homo sapiens (Human))
Philipps University Marburg
Curated by ChEMBL
LigandPNGBDBM50422420(CHEMBL4164576)
Affinity DataKi:  34nM. Assay description: Binding affinity to recombinant 17beta-HSD14 (unknown origin) expressed in Escherichia coli BL21 pLysS strain using E2 as substrate in presence of NA...
In DepthDetails ArticlePubMed