BDBM50423987 CHEMBL2313417
SMILES CC(=C)[C@@H](O)CC[C@](C)(O)[C@H]1CC[C@]2(C)[C@@H]1[C@H](O)C[C@@H]1[C@@]3(C)CC[C@H](O)C(C)(C)[C@@H]3CC[C@@]21C
InChI Key InChIKey=CZGYKNXFDCANHD-YKJFMZFHSA-N
Data  1 IC50
  Tab Delimited (TSV)   2D SDfile   Computed 3D by Vconf -m prep SDfile
Find this compound or compounds like it in BindingDB:
Activity Spreadsheet -- Enzyme Inhibition Constant Data from BindingDB
Found 1 hit for monomerid = 50423987
TargetTyrosine-protein phosphatase non-receptor type 1(Homo sapiens (Human))
Shenyang Pharmaceutical University
Curated by ChEMBL
LigandPNGBDBM50423987(CHEMBL2313417)
Affinity DataIC50: >5.00E+4nM. Assay description: Inhibition of PTP1B (unknown origin)
In DepthDetails ArticlePubMed