BDBM50423990 20(S)-Protopanaxadiol::CHEMBL375563
SMILES [#6]\[#6](-[#6])=[#6]\[#6]-[#6][C@]([#6])([#8])[#6@H]-1-[#6]-[#6][C@]2([#6])[#6@@H]-1-[#6@H](-[#8])-[#6]-[#6@@H]1[C@@]3([#6])[#6]-[#6]-[#6@H](-[#8])C([#6])([#6])[#6@@H]3-[#6]-[#6][C@@]21[#6]
InChI Key InChIKey=PYXFVCFISTUSOO-HKUCOEKDSA-N
Data  1 IC50
  Tab Delimited (TSV)   2D SDfile   Computed 3D by Vconf -m prep SDfile
Find this compound or compounds like it in BindingDB:
Activity Spreadsheet -- Enzyme Inhibition Constant Data from BindingDB
Found 1 hit for monomerid = 50423990
TargetTyrosine-protein phosphatase non-receptor type 1(Homo sapiens (Human))
Shenyang Pharmaceutical University
Curated by ChEMBL
LigandPNGBDBM50423990(20(S)-Protopanaxadiol | CHEMBL375563)
Affinity DataIC50:  2.36E+4nM. Assay description: Inhibition of PTP1B (unknown origin)
In DepthDetails ArticlePubMed