BDBM50423992 CHEMBL2313423::Gypensapogenin G
SMILES CC(=O)O[C@H]1CC[C@@]2(C)[C@@H](CC[C@]3(C)[C@@H]2CC[C@@H]2[C@H](CC[C@@]32C)C2=C[C@H](CC(C)(C)O)OC2=O)C1(C)C
InChI Key InChIKey=ZLAWDYMKBWCNPW-PDBGKUALSA-N
Data  1 IC50
  Tab Delimited (TSV)   2D SDfile   Computed 3D by Vconf -m prep SDfile
Find this compound or compounds like it in BindingDB:
Activity Spreadsheet -- Enzyme Inhibition Constant Data from BindingDB
Found 1 hit for monomerid = 50423992
TargetTyrosine-protein phosphatase non-receptor type 1(Homo sapiens (Human))
Shenyang Pharmaceutical University
Curated by ChEMBL
LigandPNGBDBM50423992(CHEMBL2313423 | Gypensapogenin G)
Affinity DataIC50:  2.45E+4nM. Assay description: Inhibition of PTP1B (unknown origin)
In DepthDetails ArticlePubMed