BDBM50425241 CHEMBL2315161
SMILES CCCCNc1nc(N)c2[nH]c(=O)n(Cc3ccc(OCCNC)nc3)c2n1
InChI Key InChIKey=YWUQGJUAXOGFOV-UHFFFAOYSA-N
Data  1 EC50
  Tab Delimited (TSV)   2D SDfile   Computed 3D by Vconf -m prep SDfile
Find this compound or compounds like it in BindingDB:
Activity Spreadsheet -- Enzyme Inhibition Constant Data from BindingDB
Found 1 hit for monomerid = 50425241
TargetToll-like receptor 7(Homo sapiens (Human))
Dainippon Sumitomo Pharma
Curated by ChEMBL
LigandPNGBDBM50425241(CHEMBL2315161)
Affinity DataEC50:  166nM. Assay description: Agonist activity at human TLR7 expressed in HEK293 cells by NFkappaB SEAP reporter gene assay
In DepthDetails ArticlePubMed