BDBM50426654 CHEMBL2326202
SMILES CCC(=O)NCCCc1cc(OC)ccc1Cc1cccc(OC)c1
InChI Key InChIKey=GJRIGACGWLYZAO-UHFFFAOYSA-N
Data  2 KI  2 EC50
  Tab Delimited (TSV)   2D SDfile   Computed 3D by Vconf -m prep SDfile
Find this compound or compounds like it in BindingDB:
Activity Spreadsheet -- Enzyme Inhibition Constant Data from BindingDB
Found 4 hits for monomerid = 50426654
TargetMelatonin receptor type 1B(Homo sapiens (Human))
Hong Kong University Of Science And Technology
Curated by ChEMBL
LigandPNGBDBM50426654(CHEMBL2326202)
Affinity DataKi:  3.40nM. Assay description: Displacement of [3H]melatonin from human MT2 receptor expressed in CHO cells after 60 mins by microbeta scintillation method
In DepthDetails ArticlePubMed
TargetMelatonin receptor type 1A(Homo sapiens (Human))
Hong Kong University Of Science And Technology
Curated by ChEMBL
LigandPNGBDBM50426654(CHEMBL2326202)
Affinity DataKi:  40nM. Assay description: Displacement of [3H]melatonin from human MT1 receptor expressed in CHO cells after 60 mins by microbeta scintillation method
In DepthDetails ArticlePubMed
TargetMelatonin receptor type 1B(Homo sapiens (Human))
Hong Kong University Of Science And Technology
Curated by ChEMBL
LigandPNGBDBM50426654(CHEMBL2326202)
Affinity DataEC50:  0.240nM. Assay description: Agonist activity at human MT2 receptor expressed in CHO cells coexpressing Galpha protein 16z25 assessed as increase in calcium mobilization measured...
In DepthDetails ArticlePubMed
TargetMelatonin receptor type 1A(Homo sapiens (Human))
Hong Kong University Of Science And Technology
Curated by ChEMBL
LigandPNGBDBM50426654(CHEMBL2326202)
Affinity DataEC50:  42nM. Assay description: Agonist activity at human MT1 receptor expressed in CHO cells coexpressing Galpha protein 16z25 assessed as increase in calcium mobilization measured...
In DepthDetails ArticlePubMed