BDBM50426777 CHEMBL2322175
SMILES CCc1nc2c(C)cn(Cc3ccccc3C)c(=O)c2n1[C@H]1CCc2cc(ccc12)-c1ccccc1-c1nnn[nH]1
InChI Key InChIKey=HMHFJSKWETWSSD-NDEPHWFRSA-N
Data  1 IC50  1 EC50
  Tab Delimited (TSV)   2D SDfile   Computed 3D by Vconf -m prep SDfile
Find this compound or compounds like it in BindingDB:
Activity Spreadsheet -- Enzyme Inhibition Constant Data from BindingDB
Found 2 hits for monomerid = 50426777
TargetType-1 angiotensin II receptor(Homo sapiens (Human))
Pfizer
Curated by ChEMBL
LigandPNGBDBM50426777(CHEMBL2322175)
Affinity DataIC50:  6.80nM. Assay description: Displacement of [125I]Tyr4-Sar1,Ile8-Angiotensin II from human Angiotensin 1 receptor after
In DepthDetails ArticlePubMed
TargetPeroxisome proliferator-activated receptor gamma(Homo sapiens (Human))
Pfizer
Curated by ChEMBL
LigandPNGBDBM50426777(CHEMBL2322175)
Affinity DataEC50:  42nM. Assay description: Partial agonist activity at human PPARgamma-LBD/Gal4 DNA binding domain by transactivation assay
In DepthDetails ArticlePubMed