BDBM50427471 CHEMBL2326971
SMILES Cc1cccc(c1)-c1csc2c1oc(cc2=O)N1CCOCC1
InChI Key InChIKey=XZIRZAZVBVOJAB-UHFFFAOYSA-N
Data  4 IC50
  Tab Delimited (TSV)   2D SDfile   Computed 3D by Vconf -m prep SDfile
Find this compound or compounds like it in BindingDB:
Activity Spreadsheet -- Enzyme Inhibition Constant Data from BindingDB
Found 4 hits for monomerid = 50427471
TargetPhosphatidylinositol 4,5-bisphosphate 3-kinase catalytic subunit gamma isoform(Homo sapiens (Human))
The University Of Arizona
Curated by ChEMBL
LigandPNGBDBM50427471(CHEMBL2326971)
Affinity DataIC50:  667nM. Assay description: Inhibition of PI3K p110gamma (unknown origin)
In DepthDetails ArticlePubMed
TargetPhosphatidylinositol 4,5-bisphosphate 3-kinase catalytic subunit beta isoform(Homo sapiens (Human))
The University Of Arizona
Curated by ChEMBL
LigandPNGBDBM50427471(CHEMBL2326971)
Affinity DataIC50:  175nM. Assay description: Inhibition of PI3K p110beta (unknown origin)
In DepthDetails ArticlePubMed
TargetPhosphatidylinositol 4,5-bisphosphate 3-kinase catalytic subunit delta isoform(Homo sapiens (Human))
The University Of Arizona
Curated by ChEMBL
LigandPNGBDBM50427471(CHEMBL2326971)
Affinity DataIC50:  4.00E+3nM. Assay description: Inhibition of PI3K p110delta (unknown origin)
In DepthDetails ArticlePubMed
TargetPhosphatidylinositol 4,5-bisphosphate 3-kinase catalytic subunit alpha isoform(Homo sapiens (Human))
The University Of Arizona
Curated by ChEMBL
LigandPNGBDBM50427471(CHEMBL2326971)
Affinity DataIC50:  116nM. Assay description: Inhibition of PI3K p110alpha (unknown origin)
In DepthDetails ArticlePubMed