BDBM50427481 CHEMBL2326963
SMILES O=C(Nc1ccncc1)c1cccc(c1)-c1csc2c1oc(cc2=O)N1CCOCC1
InChI Key InChIKey=NMUHWNOWYBANOE-UHFFFAOYSA-N
Data  1 IC50
  Tab Delimited (TSV)   2D SDfile   Computed 3D by Vconf -m prep SDfile
Find this compound or compounds like it in BindingDB:
Activity Spreadsheet -- Enzyme Inhibition Constant Data from BindingDB
Found 1 hit for monomerid = 50427481
TargetPhosphatidylinositol 4,5-bisphosphate 3-kinase catalytic subunit alpha isoform(Homo sapiens (Human))
The University Of Arizona
Curated by ChEMBL
LigandPNGBDBM50427481(CHEMBL2326963)
Affinity DataIC50:  71nM. Assay description: Inhibition of PI3K p110alpha (unknown origin)
In DepthDetails ArticlePubMed