BDBM50427493 CHEMBL2322243
SMILES O=c1cc(oc2c(csc12)-c1ccc2OCOc2c1)N1CCOCC1
InChI Key InChIKey=PCLZLYDTFKLLNN-UHFFFAOYSA-N
Data  4 IC50
  Tab Delimited (TSV)   2D SDfile   Computed 3D by Vconf -m prep SDfile
Find this compound or compounds like it in BindingDB:
Activity Spreadsheet -- Enzyme Inhibition Constant Data from BindingDB
Found 4 hits for monomerid = 50427493
TargetPhosphatidylinositol 4,5-bisphosphate 3-kinase catalytic subunit alpha isoform(Homo sapiens (Human))
The University Of Arizona
Curated by ChEMBL
LigandPNGBDBM50427493(CHEMBL2322243)
Affinity DataIC50:  75nM. Assay description: Inhibition of PI3K p110alpha (unknown origin)
In DepthDetails ArticlePubMed
TargetPhosphatidylinositol 4,5-bisphosphate 3-kinase catalytic subunit beta isoform(Homo sapiens (Human))
The University Of Arizona
Curated by ChEMBL
LigandPNGBDBM50427493(CHEMBL2322243)
Affinity DataIC50:  367nM. Assay description: Inhibition of PI3K p110beta (unknown origin)
In DepthDetails ArticlePubMed
TargetPhosphatidylinositol 4,5-bisphosphate 3-kinase catalytic subunit delta isoform(Homo sapiens (Human))
The University Of Arizona
Curated by ChEMBL
LigandPNGBDBM50427493(CHEMBL2322243)
Affinity DataIC50:  481nM. Assay description: Inhibition of PI3K p110delta (unknown origin)
In DepthDetails ArticlePubMed
TargetPhosphatidylinositol 4,5-bisphosphate 3-kinase catalytic subunit gamma isoform(Homo sapiens (Human))
The University Of Arizona
Curated by ChEMBL
LigandPNGBDBM50427493(CHEMBL2322243)
Affinity DataIC50:  385nM. Assay description: Inhibition of PI3K p110gamma (unknown origin)
In DepthDetails ArticlePubMed