BDBM50428700 CHEMBL2333116::US9884828, 2-53
SMILES CC(C)Nc1c(nnc2cc(ccc12)-c1cn[nH]c1)C(N)=O
InChI Key InChIKey=XFTPWNPHPOUHGS-UHFFFAOYSA-N
Data  2 IC50
  Tab Delimited (TSV)   2D SDfile   Computed 3D by Vconf -m prep SDfile
Find this compound or compounds like it in BindingDB:
Activity Spreadsheet -- Enzyme Inhibition Constant Data from BindingDB
Found 2 hits for monomerid = 50428700
TargetLeucine-rich repeat serine/threonine-protein kinase 2(Homo sapiens (Human))
Imago Pharmaceuticals
US Patent
LigandPNGBDBM50428700(CHEMBL2333116 | US9884828, 2-53)
Affinity DataIC50:  9nMpH: 7.5 T: 2°C. Assay description: Compounds as described herein (compounds of Formula I, e.g., compounds of the above Examples) are tested for their in vitro kinase activities using v...
In DepthDetails US Patent
TargetLeucine-rich repeat serine/threonine-protein kinase 2(Homo sapiens (Human))
Imago Pharmaceuticals
US Patent
LigandPNGBDBM50428700(CHEMBL2333116 | US9884828, 2-53)
Affinity DataIC50:  12nM. Assay description: Inhibition of wild type GST-tagged LRRK2 (970 to 2527 amino acid residues) (unknown origin) assessed as inhibition of biotinylated-LRRKtide phosphory...
In DepthDetails ArticlePubMed