BDBM50430552 CHEMBL2336904
SMILES NS(=O)(=O)c1ccc(Nc2nnc(-c3cccc(c3)S(N)(=O)=O)c3ccccc23)cc1
InChI Key InChIKey=XVWHALYHZNAWMA-UHFFFAOYSA-N
Data  1 KI  3 IC50
  Tab Delimited (TSV)   2D SDfile   Computed 3D by Vconf -m prep SDfile
Find this compound or compounds like it in BindingDB:
Activity Spreadsheet -- Enzyme Inhibition Constant Data from BindingDB
Found 4 hits for monomerid = 50430552
TargetEctonucleotide pyrophosphatase/phosphodiesterase family member 3(Homo sapiens (Human))
University Of Bonn
Curated by ChEMBL
LigandPNGBDBM50430552(CHEMBL2336904)
Affinity DataKi:  2.12E+3nM. Assay description: Inhibition of recombinant human soluble NPP3 expressed in Sf9 insect cells using ATP as substrate measured after 4 hrs by capillary electrophoresis
In DepthDetails PubMed
TargetCarbonic anhydrase 2(Homo sapiens (Human))
East China University Of Science And Technology
Curated by ChEMBL
LigandPNGBDBM50430552(CHEMBL2336904)
Affinity DataIC50:  455nM. Assay description: Inhibition of recombinant human carbonic anhydrase 2 after 15 mins by stopped flow CO2 hydration assay
In DepthDetails ArticlePubMed
TargetCarbonic anhydrase 1(Homo sapiens (Human))
East China University Of Science And Technology
Curated by ChEMBL
LigandPNGBDBM50430552(CHEMBL2336904)
Affinity DataIC50: >1.00E+4nM. Assay description: Inhibition of recombinant human carbonic anhydrase 1 after 15 mins by stopped flow CO2 hydration assay
In DepthDetails ArticlePubMed
TargetCarbonic anhydrase 9(Homo sapiens (Human))
East China University Of Science And Technology
Curated by ChEMBL
LigandPNGBDBM50430552(CHEMBL2336904)
Affinity DataIC50:  19nM. Assay description: Inhibition of recombinant human carbonic anhydrase 9 after 15 mins by stopped flow CO2 hydration assay
In DepthDetails ArticlePubMed