BDBM50430899 CHEMBL2336505
SMILES CCn1c(CNC(=O)c2ccc(C)cc2)nnc1SCC(=O)Nc1cc(ccc1C)[N+]([O-])=O
InChI Key InChIKey=SGEGUTQDQLVQKS-UHFFFAOYSA-N
Data  1 IC50
  Tab Delimited (TSV)   2D SDfile   Computed 3D by Vconf -m prep SDfile
Find this compound or compounds like it in BindingDB:
Activity Spreadsheet -- Enzyme Inhibition Constant Data from BindingDB
Found 1 hit for monomerid = 50430899
TargetProstaglandin E synthase(Homo sapiens (Human))
Peking University
Curated by ChEMBL
LigandPNGBDBM50430899(CHEMBL2336505)
Affinity DataIC50:  54nM. Assay description: Inhibition of full-length microsomal PGES-1 (unknown origin) expressed in Escherichia coli Rosetta(DE3) using PGH2 as substrate assessed as inhibitio...
In DepthDetails ArticlePubMed