BDBM50430908 CHEMBL2336496
SMILES COc1ccc(OC)c(NC(=O)CSc2nnc(CNc3c(C)cccc3C)n2C)c1
InChI Key InChIKey=FPMDABHYTXKVGL-UHFFFAOYSA-N
Data  1 IC50
  Tab Delimited (TSV)   2D SDfile   Computed 3D by Vconf -m prep SDfile
Find this compound or compounds like it in BindingDB:
Activity Spreadsheet -- Enzyme Inhibition Constant Data from BindingDB
Found 1 hit for monomerid = 50430908
TargetProstaglandin E synthase(Homo sapiens (Human))
Peking University
Curated by ChEMBL
LigandPNGBDBM50430908(CHEMBL2336496)
Affinity DataIC50:  930nM. Assay description: Inhibition of full-length microsomal PGES-1 (unknown origin) expressed in Escherichia coli Rosetta(DE3) using PGH2 as substrate assessed as inhibitio...
In DepthDetails ArticlePubMed