BDBM50430922 CHEMBL2336960
SMILES O=C(CSc1nnc(-c2ccccc2)c(n1)-c1ccccc1)c1ccc2OCC(=O)Nc2c1
InChI Key InChIKey=IJPISJNZOMRBNO-UHFFFAOYSA-N
Data  1 IC50
  Tab Delimited (TSV)   2D SDfile   Computed 3D by Vconf -m prep SDfile
Find this compound or compounds like it in BindingDB:
Activity Spreadsheet -- Enzyme Inhibition Constant Data from BindingDB
Found 1 hit for monomerid = 50430922
TargetProstaglandin E synthase(Homo sapiens (Human))
Peking University
Curated by ChEMBL
LigandPNGBDBM50430922(CHEMBL2336960)
Affinity DataIC50:  290nM. Assay description: Inhibition of full-length microsomal PGES-1 (unknown origin) expressed in Escherichia coli Rosetta(DE3) using PGH2 as substrate assessed as inhibitio...
In DepthDetails ArticlePubMed