BDBM50430924 CHEMBL2336958
SMILES Cc1ccc(cc1)-c1nnc(SCC(=O)c2c[nH]c3ccccc23)nc1-c1ccc(C)cc1
InChI Key InChIKey=VBXCPNADFVAAKK-UHFFFAOYSA-N
Data  1 IC50
  Tab Delimited (TSV)   2D SDfile   Computed 3D by Vconf -m prep SDfile
Find this compound or compounds like it in BindingDB:
Activity Spreadsheet -- Enzyme Inhibition Constant Data from BindingDB
Found 1 hit for monomerid = 50430924
TargetProstaglandin E synthase(Homo sapiens (Human))
Peking University
Curated by ChEMBL
LigandPNGBDBM50430924(CHEMBL2336958)
Affinity DataIC50:  480nM. Assay description: Inhibition of full-length microsomal PGES-1 (unknown origin) expressed in Escherichia coli Rosetta(DE3) using PGH2 as substrate assessed as inhibitio...
In DepthDetails ArticlePubMed