BDBM50430928 CHEMBL2336954
SMILES COc1ccc(cc1)C(=O)CSc1nnc(-c2ccc(OC)cc2)c(n1)-c1ccc(OC)cc1
InChI Key InChIKey=WIMGANKSRKLIOC-UHFFFAOYSA-N
Data  1 IC50
  Tab Delimited (TSV)   2D SDfile   Computed 3D by Vconf -m prep SDfile
Find this compound or compounds like it in BindingDB:
Activity Spreadsheet -- Enzyme Inhibition Constant Data from BindingDB
Found 1 hit for monomerid = 50430928
TargetProstaglandin E synthase(Homo sapiens (Human))
Peking University
Curated by ChEMBL
LigandPNGBDBM50430928(CHEMBL2336954)
Affinity DataIC50:  1.00E+3nM. Assay description: Inhibition of full-length microsomal PGES-1 (unknown origin) expressed in Escherichia coli Rosetta(DE3) using PGH2 as substrate assessed as inhibitio...
In DepthDetails ArticlePubMed