BDBM50432254 CHEMBL2347502
SMILES CSCC[C@H](NC(=O)[C@H](CC(C)C)NC(=O)CNC(=O)[C@H](Cc1ccccc1)N(C)C(=O)[C@H](Cc1ccccc1)NC(=O)[C@H](CC(O)=O)NC(=O)[C@H](CC(N)=O)NC(=O)[C@@H]1CCCN1C(=O)[C@H](CC(O)=O)NC(=O)[C@H](C)NC(=O)[C@@H]1CCC(=O)N1)C(N)=O
InChI Key InChIKey=BZLWMBKPOVFTFM-PZAIXHBZSA-N
Data  1 IC50  1 EC50
  Tab Delimited (TSV)   2D SDfile   Computed 3D by Vconf -m prep SDfile
Find this compound or compounds like it in BindingDB:
Activity Spreadsheet -- Enzyme Inhibition Constant Data from BindingDB
Found 2 hits for monomerid = 50432254
TargetNeuromedin-K receptor(Homo sapiens (Human))
Kyoto University
Curated by ChEMBL
LigandPNGBDBM50432254(CHEMBL2347502)
Affinity DataIC50:  54nM. Assay description: Displacement of ([125I]-His3, MePhe7)-NKB from NK3R (unknown origin) transfected in CHO cells by gamma counting analysis
In DepthDetails ArticlePubMed
TargetNeuromedin-K receptor(Homo sapiens (Human))
Kyoto University
Curated by ChEMBL
LigandPNGBDBM50432254(CHEMBL2347502)
Affinity DataEC50:  0.150nM. Assay description: Agonist activity at NK3R (unknown origin) transfected in CHO cells assessed as calcium influx at 10 mM
In DepthDetails ArticlePubMed