BDBM50432265 CHEMBL2347498
SMILES CSCC[C@H](NC(=O)[C@H](CC(C)C)NC(=O)CNC(=O)[C@H](Cc1ccccc1)N(C)C(=O)[C@H](Cc1ccccc1)NC(=O)CNC(=O)[C@H](CC(O)=O)NC(=O)[C@H](Cc1cnc[nH]1)NC(=O)[C@H](CCSC)NC(=O)[C@@H](N)CC(O)=O)C(N)=O
InChI Key InChIKey=AWMSWGJKRLLBPT-PVEGFDORSA-N
Data  1 IC50  1 EC50
  Tab Delimited (TSV)   2D SDfile   Computed 3D by Vconf -m prep SDfile
Find this compound or compounds like it in BindingDB:
Activity Spreadsheet -- Enzyme Inhibition Constant Data from BindingDB
Found 2 hits for monomerid = 50432265
TargetNeuromedin-K receptor(Homo sapiens (Human))
Kyoto University
Curated by ChEMBL
LigandPNGBDBM50432265(CHEMBL2347498)
Affinity DataEC50:  0.0360nM. Assay description: Agonist activity at NK3R (unknown origin) transfected in CHO cells assessed as calcium influx at 10 mM
In DepthDetails ArticlePubMed
TargetNeuromedin-K receptor(Homo sapiens (Human))
Kyoto University
Curated by ChEMBL
LigandPNGBDBM50432265(CHEMBL2347498)
Affinity DataIC50:  13nM. Assay description: Displacement of ([125I]-His3, MePhe7)-NKB from NK3R (unknown origin) transfected in CHO cells by gamma counting analysis
In DepthDetails ArticlePubMed