BDBM50435211 CHEMBL2392906
SMILES Cc1nc(nc(NC[C@H](NC(=O)CCCN2CCNCC2)c2ccccc2)c1Cl)-c1ccc(F)cn1
InChI Key InChIKey=OGUUREAHYUUHTJ-QFIPXVFZSA-N
Data  2 EC50
  Tab Delimited (TSV)   2D SDfile   Computed 3D by Vconf -m prep SDfile
Find this compound or compounds like it in BindingDB:
Activity Spreadsheet -- Enzyme Inhibition Constant Data from BindingDB
Found 2 hits for monomerid = 50435211
TargetMethionine aminopeptidase 1(Homo sapiens (Human))
Chinese Academy Of Sciences
Curated by ChEMBL
LigandPNGBDBM50435211(CHEMBL2392906)
Affinity DataEC50:  49nM. Assay description: Inhibition of human recombinant full-length cytosolic METAP1 expressed in Escherichia coli BL21(DE3) using Met-Pro-p-nitroanilide as substrate after ...
In DepthDetails ArticlePubMed
TargetMicrotubule-associated protein 2(Homo sapiens (Human))
Chinese Academy Of Sciences
Curated by ChEMBL
LigandPNGBDBM50435211(CHEMBL2392906)
Affinity DataEC50:  1.20E+3nM. Assay description: Inhibition of human recombinant GST-6XHis-tagged full-length cytosolic METAP2 expressed in cabbage looper BTI-TN-5B1-4 cells using Met-Pro-p-nitroani...
In DepthDetails ArticlePubMed