BDBM50436109 CHEMBL2397448
SMILES OC[C@H]1O[C@H]([C@H](O)[C@@H](O)[C@@H]1O)c1cc(Cc2cc3cccccc3c2)ccc1Cl
InChI Key InChIKey=HRPXJLWLTSRHQZ-ZQGJOIPISA-N
Data  1 IC50
  Tab Delimited (TSV)   2D SDfile   Computed 3D by Vconf -m prep SDfile
Find this compound or compounds like it in BindingDB:
Activity Spreadsheet -- Enzyme Inhibition Constant Data from BindingDB
Found 1 hit for monomerid = 50436109
TargetSodium/glucose cotransporter 2(Homo sapiens (Human))
Astellas Pharmaceutical
Curated by ChEMBL
LigandPNGBDBM50436109(CHEMBL2397448)
Affinity DataIC50:  70nM. Assay description: Inhibition of human SGLT2 expressed in CHO cells assessed as [14C]-methyl-alpha-D-glucopyranoside accumulation
In DepthDetails ArticlePubMed