BDBM50437176 CHEMBL2401831
SMILES CNC(=O)N1CCC(=CC1)c1coc2c(O[C@H](C)c3c(Cl)ccc(F)c3Cl)c(N)ncc12
InChI Key InChIKey=UJWGWBLKWWPRTG-LLVKDONJSA-N
Data  1 IC50
  Tab Delimited (TSV)   2D SDfile   Computed 3D by Vconf -m prep SDfile
Find this compound or compounds like it in BindingDB:
Activity Spreadsheet -- Enzyme Inhibition Constant Data from BindingDB
Found 1 hit for monomerid = 50437176
TargetHepatocyte growth factor receptor(Homo sapiens (Human))
Osi Pharmaceuticals
Curated by ChEMBL
LigandPNGBDBM50437176(CHEMBL2401831)
Affinity DataIC50:  280nM. Assay description: Inhibition of cMET (unknown origin) using biotinylated poly(Glu,Tyr) as substrate after 60 mins
In DepthDetails ArticlePubMed